Reaction Details
TargetKappa-type opioid receptor
LigandBDBM50330441
Substrate/Competitorn/a
Meas. Tech.ChEMBL_684921 (CHEMBL1286336)
IC50>1000±n/a nM
Citation Asagarasu, AMatsui, THayashi, HTamaoki, SYamauchi, YMinato, KSato, M Discovery of a novel 5-HT(3) antagonist/5-HT(1A) agonist 3-amino-5,6,7,8-tetrahydro-2-{4-[4-(quinolin-2-yl)piperazin-1-yl]butyl}quinazolin-4(3H)-one (TZB-30878) as an orally bioavailable agent for irritable bowel syndrome. J Med Chem53:7549-63 (2010) 
 
Kappa-type opioid receptor
Name:Kappa-type opioid receptor
Type:G Protein-Coupled Receptor (GPCR)
Mol. Mass.:42744.99
Organism:Cavia porcellus (domestic guinea pig)
Description:P41144
Residue:380
BDBM50330441
NameBDBM50330441
Synonyms:3-amino-2-(4-(4-(quinolin-2-yl)piperazin-1-yl)butyl)-5,6,7,8-tetrahydroquinazolin-4(3H)-one | CHEMBL1278088
TypeSmall organic molecule
Emp. Form.C25H32N6O
Mol. Mass.432.5612
SMILESNn1c(CCCCN2CCN(CC2)c2ccc3ccccc3n2)nc2CCCCc2c1=O