Reaction Details
Target5-hydroxytryptamine receptor 1A
LigandBDBM50330465
Substrate/Competitorn/a
Meas. Tech.ChEMBL_684850 (CHEMBL1286080)
IC50 46.6±n/a nM
Citation Asagarasu, AMatsui, THayashi, HTamaoki, SYamauchi, YMinato, KSato, M Discovery of a novel 5-HT(3) antagonist/5-HT(1A) agonist 3-amino-5,6,7,8-tetrahydro-2-{4-[4-(quinolin-2-yl)piperazin-1-yl]butyl}quinazolin-4(3H)-one (TZB-30878) as an orally bioavailable agent for irritable bowel syndrome. J Med Chem53:7549-63 (2010) 
 
5-hydroxytryptamine receptor 1A
Name:5-hydroxytryptamine receptor 1A
Type:n/a
Mol. Mass.:46122.49
Organism:Homo sapiens (Human)
Description:n/a
Residue:422
BDBM50330465
NameBDBM50330465
Synonyms:3-Amino-2-[4-[4-(7-hydroxyquinolin-2-yl)piperazin-1-yl]butyl]-5,6,7,8-tetrahydro-3H-quinazolin-4-one | CHEMBL1277373
TypeSmall organic molecule
Emp. Form.C25H32N6O2
Mol. Mass.448.5606
SMILESNn1c(CCCCN2CCN(CC2)c2ccc3ccc(O)cc3n2)nc2CCCCc2c1=O