Reaction Details
Target5-hydroxytryptamine receptor 3A
LigandBDBM50330444
Substrate/Competitorn/a
Meas. Tech.ChEMBL_684849 (CHEMBL1286079)
IC50>100±n/a nM
Citation Asagarasu, AMatsui, THayashi, HTamaoki, SYamauchi, YMinato, KSato, M Discovery of a novel 5-HT(3) antagonist/5-HT(1A) agonist 3-amino-5,6,7,8-tetrahydro-2-{4-[4-(quinolin-2-yl)piperazin-1-yl]butyl}quinazolin-4(3H)-one (TZB-30878) as an orally bioavailable agent for irritable bowel syndrome. J Med Chem53:7549-63 (2010) 
 
5-hydroxytryptamine receptor 3A
Name:5-hydroxytryptamine receptor 3A
Type:Protein
Mol. Mass.:55283.27
Organism:Homo sapiens (Human)
Description:P46098
Residue:478
BDBM50330444
NameBDBM50330444
Synonyms:3-Amino-7-nitro-2-[3-(4-quinolin-2-ylpiperazin-1-yl)propylthio]-3H-quinazolin-4-one | CHEMBL1277371
TypeSmall organic molecule
Emp. Form.C24H25N7O3S
Mol. Mass.491.565
SMILESNn1c(SCCCN2CCN(CC2)c2ccc3ccccc3n2)nc2cc(ccc2c1=O)[N+]([O-])=O