Reaction Details
Target5-hydroxytryptamine receptor 1A
LigandBDBM50330477
Substrate/Competitorn/a
Meas. Tech.ChEMBL_684850 (CHEMBL1286080)
IC50 66.6±n/a nM
Citation Asagarasu, AMatsui, THayashi, HTamaoki, SYamauchi, YMinato, KSato, M Discovery of a novel 5-HT(3) antagonist/5-HT(1A) agonist 3-amino-5,6,7,8-tetrahydro-2-{4-[4-(quinolin-2-yl)piperazin-1-yl]butyl}quinazolin-4(3H)-one (TZB-30878) as an orally bioavailable agent for irritable bowel syndrome. J Med Chem53:7549-63 (2010) 
 
5-hydroxytryptamine receptor 1A
Name:5-hydroxytryptamine receptor 1A
Type:n/a
Mol. Mass.:46122.49
Organism:Homo sapiens (Human)
Description:n/a
Residue:422
BDBM50330477
NameBDBM50330477
Synonyms:3-Amino-2-[3-(4-benzothiazol-2-ylpiperazin-1-yl)propylthio]-5,6-dimethyl-3H-thieno[2,3-d]pyrimidin-4-one | CHEMBL1276920
TypeSmall organic molecule
Emp. Form.C22H26N6OS3
Mol. Mass.486.676
SMILESCc1sc2nc(SCCCN3CCN(CC3)c3nc4ccccc4s3)n(N)c(=O)c2c1C