Reaction Details
TargetMaltase-glucoamylase
LigandBDBM50330961
Substrate/Competitorn/a
Meas. Tech.ChEMBL_684093 (CHEMBL1286470)
Ki 20±n/a nM
Citation Mohan, SSim, LRose, DRPinto, BM Probing the active-site requirements of human intestinal N-terminal maltase-glucoamylase: Synthesis and enzyme inhibitory activities of a six-membered ring nitrogen analogue of kotalanol and its de-O-sulfonated derivative. Bioorg Med Chem18:7794-8 (2010) 
 
Maltase-glucoamylase
Name:Maltase-glucoamylase
Type:Enzyme
Mol. Mass.:209817.06
Organism:Homo sapiens (Human)
Description:O43451
Residue:2753
BDBM50330961
NameBDBM50330961
Synonyms:(2R,3S,4S)-1-((2S,3S,4R,5R,6S)-2,3,4,5,6,7-hexahydroxyheptyl)-3,4-dihydroxy-2-(hydroxymethyl)tetrahydro-1H-selenophenium chloride | CHEMBL1277241
TypeSmall organic molecule
Emp. Form.C12H25O9Se
Mol. Mass.392.28
SMILESOC[C@H](O)[C@@H](O)[C@@H](O)[C@H](O)[C@H](O)C[Se+]1C[C@@H](O)[C@H](O)[C@H]1CO