Reaction Details
TargetPteridine reductase 1
LigandBDBM10458
Substrate/Competitorn/a
Meas. Tech.ChEMBL_702836 (CHEMBL1655366)
IC50 1900000±n/a nM
Citation Shi, KHuang, QHuang, YLee, TCYu, H Reducing the brittleness of zein films through chemical modification. J Agric Food Chem59:56-61 (2011) 
 
Pteridine reductase 1
Name:Pteridine reductase 1
Type:PROTEIN
Mol. Mass.:30459.34
Organism:Leishmania major
Description:ChEMBL_1470027
Residue:288
BDBM10458
NameBDBM10458
Synonyms:4-AP CHEMBL284348 pyridin-4-amine
TypeSmall organic molecule
Emp. Form.C5H6N2
Mol. Mass.94.1145
SMILESNc1ccncc1