Reaction Details
TargetTranslocator protein
LigandBDBM50335256
Substrate/Competitorn/a
Meas. Tech.ChEMBL_702766 (CHEMBL1655209)
Ki 12±n/a nM
Citation Pike, VWTaliani, SLohith, TGOwen, DRPugliesi, IDa Pozzo, EHong, JZoghbi, SSGunn, RNParker, CARabiner, EAFujita, MInnis, RBMartini, CDa Settimo, F Evaluation of novel N1-methyl-2-phenylindol-3-ylglyoxylamides as a new chemotype of 18 kDa translocator protein-selective ligand suitable for the development of positron emission tomography radioligands. J Med Chem54:366-73 (2011) 
 
Translocator protein
Name:Translocator protein
Type:Mitochondrion membrane protein
Mol. Mass.:18945.84
Organism:Rattus norvegicus (rat)
Description:Competitive binding experiments were performed on rat kidney mitochondrial membranes.
Residue:169
BDBM50335256
NameBDBM50335256
Synonyms:CHEMBL1651222 | N-benzyl-N-methyl-2-oxo-2-(2-phenyl-1H-indol-3-yl)acetamide
TypeSmall organic molecule
Emp. Form.C24H20N2O2
Mol. Mass.368.4278
SMILESCN(Cc1ccccc1)C(=O)C(=O)c1c([nH]c2ccccc12)-c1ccccc1