Reaction Details
TargetCytochrome P450 3A4
LigandBDBM50335380
Substrate/Competitorn/a
Meas. Tech.ChEMBL_701747 (CHEMBL1656750)
IC50 800±n/a nM
Citation Johnson, DSStiff, CLazerwith, SEKesten, SRFay, LKMorris, MBeidler, DLiimatta, MBSmith, SEDudley, DTSadagopan, NBhattachar, SNKesten, SJNomanbhoy, TKCravatt, BFAhn, K Discovery of PF-04457845: A Highly Potent, Orally Bioavailable, and Selective Urea FAAH Inhibitor. ACS Med Chem Lett2:91-96 (2011) 
 
Cytochrome P450 3A4
Name:Cytochrome P450 3A4
Type:Enzyme
Mol. Mass.:57349.57
Organism:Homo sapiens (Human)
Description:n/a
Residue:503
BDBM50335380
NameBDBM50335380
Synonyms:CHEMBL1651525 | N-Pyridin-3-yl-4-(3-{[5-(trifluoromethyl)pyridin-2-yl]oxy}benzylidene)piperidine-1-carboxamide
TypeSmall organic molecule
Emp. Form.C24H21F3N4O2
Mol. Mass.454.4443
SMILESFC(F)(F)c1ccc(-[#8]-c2cccc(\[#6]=[#6]-3\[#6]-[#6]-[#7](-[#6]-[#6]-3)-[#6](=O)-[#7]-c3cccnc3)c2)nc1