Reaction Details
TargetKiSS-1 receptor
LigandBDBM26339
Substrate/Competitorn/a
Meas. Tech.ChEMBL_718922 (CHEMBL1681416)
IC50 0.120±n/a nM
Citation Oishi, SMisu, RTomita, KSetsuda, SMasuda, ROhno, HNaniwa, YIeda, NInoue, NOhkura, SUenoyama, YTsukamura, HMaeda, KHirasawa, ATsujimoto, GFujii, N Activation of Neuropeptide FF Receptors by Kisspeptin Receptor Ligands. ACS Med Chem Lett2:53-57 (2011) 
 
KiSS-1 receptor
Name:KiSS-1 receptor
Type:G Protein-Coupled Receptor (GPCR)
Mol. Mass.:42613.79
Organism:Homo sapiens (Human)
Description:Binding assay was performed using membranes from the CHO cell transfectants.
Residue:398
BDBM26339
NameBDBM26339
Synonyms:(2R,3E)-N-[(1S)-4-carbamimidamido-1-{[(1S)-1-carbamoyl-2-(1H-indol-3-yl)ethyl]carbamoyl}butyl]-5-[(2S)-2-[(4-fluorophenyl)formamido]-3-phenylpropanamido]-2-(2-methylpropyl)pent-3-enamide | Peptide analogue, 19
Typen/a
Emp. Form.C42H52FN9O5
Mol. Mass.781.918
SMILESCC(C)C[C@H](\C=C\CNC(=O)[C@H](Cc1ccccc1)NC(=O)c1ccc(F)cc1)C(=O)N[C@@H](CCCN=C(N)N)C(=O)N[C@@H](Cc1c[nH]c2ccccc12)C(N)=O