Reaction Details
TargetCytochrome P450 2C9
LigandBDBM50343353
Substrate/Competitorn/a
Meas. Tech.ChEMBL_747041 (CHEMBL1777407)
IC50>30000±n/a nM
Citation Zehnder, LBennett, MMeng, JHuang, BNinkovic, SWang, FBraganza, JTatlock, JJewell, TZhou, JZBurke, BWang, JMaegley, KMehta, PPYin, MJGajiwala, KSHickey, MJYamazaki, SSmith, EKang, PSistla, ADovalsantos, EGehring, MRKania, RWythes, MKung, PP Optimization of potent, selective, and orally bioavailable pyrrolodinopyrimidine-containing inhibitors of heat shock protein 90. Identification of development candidate 2-amino-4-{4-chloro-2-[2-(4-fluoro-1H-pyrazol-1-yl)ethoxy]-6-methylphenyl}-N-(2,2-difluoropropyl)-5,7-dihydro-6H-pyrrolo[3,4-d]pyr J Med Chem54:3368-85 (2011) 
 
Cytochrome P450 2C9
Name:Cytochrome P450 2C9
Type:Enzyme
Mol. Mass.:55636.33
Organism:Homo sapiens (Human)
Description:P11712
Residue:490
BDBM50343353
NameBDBM50343353
Synonyms:2-Amino-4-{4-chloro-2-[2-(4-fluoropyrazol-1-yl)ethoxy]-6-methylphenyl}-5,7-dihydropyrrolo[3,4-d]pyrimidine-6-carboxylic Acid(2,2-Difluoropropyl)amide | CHEMBL1774933
TypeSmall organic molecule
Emp. Form.C22H23ClF3N7O2
Mol. Mass.509.912
SMILESCc1cc(Cl)cc(OCCn2cc(F)cn2)c1-c1nc(N)nc2CN(Cc12)C(=O)NCC(C)(F)F