Reaction Details
TargetHeat shock protein HSP 90-alpha
LigandBDBM50343364
Substrate/Competitorn/a
Meas. Tech.ChEMBL_746939 (CHEMBL1777305)
Ki 130±n/a nM
Citation Zehnder, LBennett, MMeng, JHuang, BNinkovic, SWang, FBraganza, JTatlock, JJewell, TZhou, JZBurke, BWang, JMaegley, KMehta, PPYin, MJGajiwala, KSHickey, MJYamazaki, SSmith, EKang, PSistla, ADovalsantos, EGehring, MRKania, RWythes, MKung, PP Optimization of potent, selective, and orally bioavailable pyrrolodinopyrimidine-containing inhibitors of heat shock protein 90. Identification of development candidate 2-amino-4-{4-chloro-2-[2-(4-fluoro-1H-pyrazol-1-yl)ethoxy]-6-methylphenyl}-N-(2,2-difluoropropyl)-5,7-dihydro-6H-pyrrolo[3,4-d]pyr J Med Chem54:3368-85 (2011) 
 
Heat shock protein HSP 90-alpha
Name:Heat shock protein HSP 90-alpha
Type:Molecular Chaperone
Mol. Mass.:84623.45
Organism:Homo sapiens (Human)
Description:P07900
Residue:732
BDBM50343364
NameBDBM50343364
Synonyms:4-[2-Chloro-6-(4,4,4-trifluoro-butoxy)-phenyl]-6-methyl-pyrimidin-2-ylamine CHEMBL1738804
TypeSmall organic molecule
Emp. Form.C15H15ClF3N3O
Mol. Mass.345.747
SMILESCc1cc(nc(N)n1)-c1c(Cl)cccc1OCCCC(F)(F)F