Reaction Details
TargetHeat shock protein HSP 90-alpha
LigandBDBM50343375
Substrate/Competitorn/a
Meas. Tech.ChEMBL_746939 (CHEMBL1777305)
Ki 300±n/a nM
Citation Zehnder, LBennett, MMeng, JHuang, BNinkovic, SWang, FBraganza, JTatlock, JJewell, TZhou, JZBurke, BWang, JMaegley, KMehta, PPYin, MJGajiwala, KSHickey, MJYamazaki, SSmith, EKang, PSistla, ADovalsantos, EGehring, MRKania, RWythes, MKung, PP Optimization of potent, selective, and orally bioavailable pyrrolodinopyrimidine-containing inhibitors of heat shock protein 90. Identification of development candidate 2-amino-4-{4-chloro-2-[2-(4-fluoro-1H-pyrazol-1-yl)ethoxy]-6-methylphenyl}-N-(2,2-difluoropropyl)-5,7-dihydro-6H-pyrrolo[3,4-d]pyr J Med Chem54:3368-85 (2011) 
 
Heat shock protein HSP 90-alpha
Name:Heat shock protein HSP 90-alpha
Type:Molecular Chaperone
Mol. Mass.:84623.45
Organism:Homo sapiens (Human)
Description:P07900
Residue:732
BDBM50343375
NameBDBM50343375
Synonyms:2-Amino-4-[2,4-dichloro-6-(3-cyano-3,3-dimethylpropoxy)phenyl]-5,7-dihydropyrrolo[3,4-d]pyrimidine-6-carboxylic Acid Cyclobutylamide | CHEMBL1774913
TypeSmall organic molecule
Emp. Form.C23H26Cl2N6O2
Mol. Mass.489.398
SMILESCC(C)(CCOc1cc(Cl)cc(Cl)c1-c1nc(N)nc2CN(Cc12)C(=O)NC1CCC1)C#N