Reaction Details
TargetHeat shock protein HSP 90-alpha
LigandBDBM50343384
Substrate/Competitorn/a
Meas. Tech.ChEMBL_746939 (CHEMBL1777305)
Ki 12±n/a nM
Citation Zehnder, LBennett, MMeng, JHuang, BNinkovic, SWang, FBraganza, JTatlock, JJewell, TZhou, JZBurke, BWang, JMaegley, KMehta, PPYin, MJGajiwala, KSHickey, MJYamazaki, SSmith, EKang, PSistla, ADovalsantos, EGehring, MRKania, RWythes, MKung, PP Optimization of potent, selective, and orally bioavailable pyrrolodinopyrimidine-containing inhibitors of heat shock protein 90. Identification of development candidate 2-amino-4-{4-chloro-2-[2-(4-fluoro-1H-pyrazol-1-yl)ethoxy]-6-methylphenyl}-N-(2,2-difluoropropyl)-5,7-dihydro-6H-pyrrolo[3,4-d]pyr J Med Chem54:3368-85 (2011) 
 
Heat shock protein HSP 90-alpha
Name:Heat shock protein HSP 90-alpha
Type:Molecular Chaperone
Mol. Mass.:84623.45
Organism:Homo sapiens (Human)
Description:P07900
Residue:732
BDBM50343384
NameBDBM50343384
Synonyms:4-(2-(2-(1H-pyrazol-1-yl)ethoxy)-4,6-dichlorophenyl)-2-amino-N-cyclopropyl-5H-pyrrolo[3,4-d]pyrimidine-6(7H)-carboxamide | CHEMBL1774922
TypeSmall organic molecule
Emp. Form.C21H21Cl2N7O2
Mol. Mass.474.343
SMILESNc1nc2CN(Cc2c(n1)-c1c(Cl)cc(Cl)cc1OCCn1cccn1)C(=O)NC1CC1