Reaction Details
TargetMuscarinic acetylcholine receptor M3
LigandBDBM50345676
Substrate/Competitorn/a
Meas. Tech.ChEMBL_750511 (CHEMBL1786272)
IC50 134±n/a nM
Citation Lainé, DIWan, ZYan, HZhu, CXie, HFu, WBusch-Petersen, JNeipp, CDavis, RWiddowson, KLBlaney, FEFoley, JBacon, AMWebb, EFLuttmann, MABurman, MSarau, HMSalmon, MPalovich, MRBelmonte, K Design, synthesis, and structure-activity relationship of tropane muscarinic acetylcholine receptor antagonists. J Med Chem52:5241-52 (2010) 
 
Muscarinic acetylcholine receptor M3
Name:Muscarinic acetylcholine receptor M3
Type:Enzyme
Mol. Mass.:66151.03
Organism:Homo sapiens (Human)
Description:P20309
Residue:590
BDBM50345676
NameBDBM50345676
Synonyms:3-(endo-8-methyl-8-azabicyclo[3.2.1]octan-3-yl)-1,1-diphenylpropan-1-ol | CHEMBL1782088
TypeSmall organic molecule
Emp. Form.C23H29NO
Mol. Mass.335.4825
SMILESCN1[C@@H]2CC[C@@H]1CC(CCC(O)(c1ccccc1)c1ccccc1)C2