Reaction Details
TargetMuscarinic acetylcholine receptor M3
LigandBDBM50345678
Substrate/Competitorn/a
Meas. Tech.ChEMBL_750511 (CHEMBL1786272)
IC50 135±n/a nM
Citation Lainé, DIWan, ZYan, HZhu, CXie, HFu, WBusch-Petersen, JNeipp, CDavis, RWiddowson, KLBlaney, FEFoley, JBacon, AMWebb, EFLuttmann, MABurman, MSarau, HMSalmon, MPalovich, MRBelmonte, K Design, synthesis, and structure-activity relationship of tropane muscarinic acetylcholine receptor antagonists. J Med Chem52:5241-52 (2010) 
 
Muscarinic acetylcholine receptor M3
Name:Muscarinic acetylcholine receptor M3
Type:Enzyme
Mol. Mass.:66151.03
Organism:Homo sapiens (Human)
Description:P20309
Residue:590
BDBM50345678
NameBDBM50345678
Synonyms:1-(endo-8-methyl-8-azabicyclo[3.2.1]octan-3-yl)-2-phenylbutan-2-ol | CHEMBL1782091
TypeSmall organic molecule
Emp. Form.C18H27NO
Mol. Mass.273.4131
SMILESCCC(O)(CC1C[C@H]2CC[C@H](C1)N2C)c1ccccc1