Reaction Details
TargetMuscarinic acetylcholine receptor M3
LigandBDBM50345682
Substrate/Competitorn/a
Meas. Tech.ChEMBL_750511 (CHEMBL1786272)
IC50 25±n/a nM
Citation Lainé, DIWan, ZYan, HZhu, CXie, HFu, WBusch-Petersen, JNeipp, CDavis, RWiddowson, KLBlaney, FEFoley, JBacon, AMWebb, EFLuttmann, MABurman, MSarau, HMSalmon, MPalovich, MRBelmonte, K Design, synthesis, and structure-activity relationship of tropane muscarinic acetylcholine receptor antagonists. J Med Chem52:5241-52 (2010) 
 
Muscarinic acetylcholine receptor M3
Name:Muscarinic acetylcholine receptor M3
Type:Enzyme
Mol. Mass.:66151.03
Organism:Homo sapiens (Human)
Description:P20309
Residue:590
BDBM50345682
NameBDBM50345682
Synonyms:(3-endo)-3-[2,2-Bis(3-chlorophenyl)-2-hydroxyethyl]-8,8-dimethyl-8-azoniabicyclo[3.2.1]octane Iodide | CHEMBL1782096
TypeSmall organic molecule
Emp. Form.C23H28Cl2NO
Mol. Mass.405.38
SMILESC[N+]1(C)[C@@H]2CC[C@@H]1CC(CC(O)(c1cccc(Cl)c1)c1cccc(Cl)c1)C2