Reaction Details
TargetMuscarinic acetylcholine receptor M3
LigandBDBM50345684
Substrate/Competitorn/a
Meas. Tech.ChEMBL_750511 (CHEMBL1786272)
IC50 74±n/a nM
Citation Lainé, DIWan, ZYan, HZhu, CXie, HFu, WBusch-Petersen, JNeipp, CDavis, RWiddowson, KLBlaney, FEFoley, JBacon, AMWebb, EFLuttmann, MABurman, MSarau, HMSalmon, MPalovich, MRBelmonte, K Design, synthesis, and structure-activity relationship of tropane muscarinic acetylcholine receptor antagonists. J Med Chem52:5241-52 (2010) 
 
Muscarinic acetylcholine receptor M3
Name:Muscarinic acetylcholine receptor M3
Type:Enzyme
Mol. Mass.:66151.03
Organism:Homo sapiens (Human)
Description:P20309
Residue:590
BDBM50345684
NameBDBM50345684
Synonyms:(3-endo)-1,1-Bis-(4-chlorophenyl)-2-(8,8-dimethyl-8-azoniabicyclo[3.2.1]oct-3-yl)ethanol Iodide | CHEMBL1782098
TypeSmall organic molecule
Emp. Form.C23H28Cl2NO
Mol. Mass.405.38
SMILESC[N+]1(C)[C@@H]2CC[C@@H]1CC(CC(O)(c1ccc(Cl)cc1)c1ccc(Cl)cc1)C2