Reaction Details
TargetPotassium voltage-gated channel subfamily H member 2
LigandBDBM50347670
Substrate/Competitorn/a
Meas. Tech.ChEMBL_755897 (CHEMBL1803706)
IC50 4300±n/a nM
Citation Katz, JDJewell, JPGuerin, DJLim, JDinsmore, CJDeshmukh, SVPan, BSMarshall, CGLu, WAltman, MDDahlberg, WKDavis, LFalcone, DGabarda, AEHang, GHatch, HHolmes, RKunii, KLumb, KJLutterbach, BMathvink, RNazef, NPatel, SBQu, XReilly, JFRickert, KWRosenstein, CSoisson, SMSpencer, KBSzewczak, AAWalker, DWang, WYoung, JZeng, Q Discovery of a 5H-benzo[4,5]cyclohepta[1,2-b]pyridin-5-one (MK-2461) inhibitor of c-Met kinase for the treatment of cancer. J Med Chem54:4092-108 (2011) 
 
Potassium voltage-gated channel subfamily H member 2
Name:Potassium voltage-gated channel subfamily H member 2
Type:Multi-pass membrane protein
Mol. Mass.:126672.65
Organism:Homo sapiens (Human)
Description:Q12809
Residue:1159
BDBM50347670
NameBDBM50347670
Synonyms:CHEMBL1802906
TypeSmall organic molecule
Emp. Form.C18H15N5O3S
Mol. Mass.381.408
SMILESCn1cc(cn1)-c1cnc2ccc3ccc(NS(N)(=O)=O)cc3c(=O)c2c1