Reaction Details
TargetProtein-tyrosine-phosphatase
LigandBDBM26193
Substrate/Competitorn/a
Meas. Tech.ChEMBL_810616 (CHEMBL2015667)
Ki 1000000±n/a nM
Citation He, YZeng, LFYu, ZHHe, RLiu, SZhang, ZY Bicyclic benzofuran and indole-based salicylic acids as protein tyrosine phosphatase inhibitors. Bioorg Med Chem20:1940-6 (2012) 
 
Protein-tyrosine-phosphatase
Name:Protein-tyrosine-phosphatase
Type:PROTEIN
Mol. Mass.:50881.86
Organism:Yersinia pestis
Description:ChEMBL_810616
Residue:468
BDBM26193
NameBDBM26193
Synonyms:2-Hydroxybenzoate, I CHEMBL424 salicylic acid
TypeSmall organic molecule
Emp. Form.C7H6O3
Mol. Mass.138.1207
SMILESOC(=O)c1ccccc1O