Reaction Details
TargetTyrosine-protein kinase Blk
LigandBDBM50379186
Substrate/Competitorn/a
Meas. Tech.ChEMBL_810654 (CHEMBL2015705)
IC50 8±n/a nM
Citation Hudkins, RLBecknell, NCZulli, ALUnderiner, TLAngeles, TSAimone, LDAlbom, MSChang, HMiknyoczki, SJHunter, KJones-Bolin, SZhao, HBacon, ERMallamo, JPAtor, MARuggeri, BA Synthesis and biological profile of the pan-vascular endothelial growth factor receptor/tyrosine kinase with immunoglobulin and epidermal growth factor-like homology domains 2 (VEGF-R/TIE-2) inhibitor 11-(2-methylpropyl)-12,13-dihydro-2-methyl-8-(pyrimidin-2-ylamino)-4H-indazolo[5,4-a]pyrrolo[3,4-c J Med Chem55:903-13 (2012) 
 
Tyrosine-protein kinase Blk
Name:Tyrosine-protein kinase Blk
Type:PROTEIN
Mol. Mass.:56676.10
Organism:Mus musculus
Description:ChEMBL_810654
Residue:499
BDBM50379186
NameBDBM50379186
Synonyms:CEP-11981 | CHEMBL2010872
TypeSmall organic molecule
Emp. Form.C28H27N7O
Mol. Mass.477.5603
SMILESCC(C)Cn1c2ccc(Nc3ncccn3)cc2c2c3CNC(=O)c3c3-c4cn(C)nc4CCc3c12