Reaction Details
TargetAngiopoietin-1 receptor
LigandBDBM50379195
Substrate/Competitorn/a
Meas. Tech.ChEMBL_810622 (CHEMBL2015673)
IC50 4±n/a nM
Citation Hudkins, RLBecknell, NCZulli, ALUnderiner, TLAngeles, TSAimone, LDAlbom, MSChang, HMiknyoczki, SJHunter, KJones-Bolin, SZhao, HBacon, ERMallamo, JPAtor, MARuggeri, BA Synthesis and biological profile of the pan-vascular endothelial growth factor receptor/tyrosine kinase with immunoglobulin and epidermal growth factor-like homology domains 2 (VEGF-R/TIE-2) inhibitor 11-(2-methylpropyl)-12,13-dihydro-2-methyl-8-(pyrimidin-2-ylamino)-4H-indazolo[5,4-a]pyrrolo[3,4-c J Med Chem55:903-13 (2012) 
 
Angiopoietin-1 receptor
Name:Angiopoietin-1 receptor
Type:Enzyme
Mol. Mass.:125835.70
Organism:Homo sapiens (Human)
Description:Q02763
Residue:1124
BDBM50379195
NameBDBM50379195
Synonyms:CHEMBL2010869
TypeSmall organic molecule
Emp. Form.C29H29N7O
Mol. Mass.491.5869
SMILESCCCn1c2ccc(Nc3ncc(CC)cn3)cc2c2c3CNC(=O)c3c3-c4cn(C)nc4CCc3c12