Reaction Details
TargetVascular endothelial growth factor receptor 2
LigandBDBM50379194
Substrate/Competitorn/a
Meas. Tech.ChEMBL_810621 (CHEMBL2015672)
IC50 14±n/a nM
Citation Hudkins, RLBecknell, NCZulli, ALUnderiner, TLAngeles, TSAimone, LDAlbom, MSChang, HMiknyoczki, SJHunter, KJones-Bolin, SZhao, HBacon, ERMallamo, JPAtor, MARuggeri, BA Synthesis and biological profile of the pan-vascular endothelial growth factor receptor/tyrosine kinase with immunoglobulin and epidermal growth factor-like homology domains 2 (VEGF-R/TIE-2) inhibitor 11-(2-methylpropyl)-12,13-dihydro-2-methyl-8-(pyrimidin-2-ylamino)-4H-indazolo[5,4-a]pyrrolo[3,4-c J Med Chem55:903-13 (2012) 
 
Vascular endothelial growth factor receptor 2
Name:Vascular endothelial growth factor receptor 2
Type:Receptor Tyrosine Kinase
Mol. Mass.:151510.97
Organism:Homo sapiens (Human)
Description:P35968
Residue:1356
BDBM50379194
NameBDBM50379194
Synonyms:CHEMBL2010873
TypeSmall organic molecule
Emp. Form.C30H31N7O
Mol. Mass.505.6134
SMILESCCc1cnc(Nc2ccc3n(CC(C)C)c4c5CCc6nn(C)cc6-c5c5C(=O)NCc5c4c3c2)nc1