Reaction Details
TargetPotassium voltage-gated channel subfamily H member 2
LigandBDBM50379442
Substrate/Competitorn/a
Meas. Tech.ChEMBL_812135 (CHEMBL2013639)
Ki 1500±n/a nM
Citation Chakka, NBregman, HDu, BNguyen, HNBuchanan, JLFeric, ELigutti, JLiu, DMcDermott, JSZou, AMcDonough, SIDimauro, EF Discovery and hit-to-lead optimization of pyrrolopyrimidines as potent, state-dependent Na(v)1.7 antagonists. Bioorg Med Chem Lett22:2052-62 (2012) 
 
Potassium voltage-gated channel subfamily H member 2
Name:Potassium voltage-gated channel subfamily H member 2
Type:Multi-pass membrane protein
Mol. Mass.:126672.65
Organism:Homo sapiens (Human)
Description:Q12809
Residue:1159
BDBM50379442
NameBDBM50379442
Synonyms:CHEMBL2012181
TypeSmall organic molecule
Emp. Form.C22H22ClN5OS
Mol. Mass.439.961
SMILESClc1cn(Cc2ccccc2)c2ncnc(OC3CCN(Cc4cscn4)CC3)c12