Reaction Details
TargetPotassium voltage-gated channel subfamily H member 2
LigandBDBM50379465
Substrate/Competitorn/a
Meas. Tech.ChEMBL_812135 (CHEMBL2013639)
Ki 980±n/a nM
Citation Chakka, NBregman, HDu, BNguyen, HNBuchanan, JLFeric, ELigutti, JLiu, DMcDermott, JSZou, AMcDonough, SIDimauro, EF Discovery and hit-to-lead optimization of pyrrolopyrimidines as potent, state-dependent Na(v)1.7 antagonists. Bioorg Med Chem Lett22:2052-62 (2012) 
 
Potassium voltage-gated channel subfamily H member 2
Name:Potassium voltage-gated channel subfamily H member 2
Type:Multi-pass membrane protein
Mol. Mass.:126672.65
Organism:Homo sapiens (Human)
Description:Q12809
Residue:1159
BDBM50379465
NameBDBM50379465
Synonyms:CHEMBL2012291
TypeSmall organic molecule
Emp. Form.C25H27N5O
Mol. Mass.413.5148
SMILESCc1ccc(CN2CCC(CC2)Oc2ncnc3n(Cc4ccccc4)ccc23)nc1