Reaction Details
TargetMatrix metalloproteinase-14
LigandBDBM50379533
Substrate/Competitorn/a
Meas. Tech.ChEMBL_811341 (CHEMBL2013521)
Ki>50000±n/a nM
Citation Jiao, GSKim, SMoayeri, MCrown, DThai, ACregar-Hernandez, LMcKasson, LSankaran, BLehrer, AWong, TJohns, LMargosiak, SALeppla, SHJohnson, AT Antidotes to anthrax lethal factor intoxication. Part 3: Evaluation of core structures and further modifications to the C2-side chain. Bioorg Med Chem Lett22:2242-6 (2012) 
 
Matrix metalloproteinase-14
Name:Matrix metalloproteinase-14
Type:Protein
Mol. Mass.:65900.19
Organism:Homo sapiens (Human)
Description:P50281
Residue:582
BDBM50379533
NameBDBM50379533
Synonyms:CHEMBL2012838
TypeSmall organic molecule
Emp. Form.C24H32F2N2O3
Mol. Mass.434.5193
SMILESCCC(NCCCC[C@@H](C[C@@H](OC)c1ccc(F)cc1)C(=O)NO)c1ccc(F)cc1