Reaction Details
TargetMatrix metalloproteinase-14
LigandBDBM50379535
Substrate/Competitorn/a
Meas. Tech.ChEMBL_811341 (CHEMBL2013521)
Ki>50000±n/a nM
Citation Jiao, GSKim, SMoayeri, MCrown, DThai, ACregar-Hernandez, LMcKasson, LSankaran, BLehrer, AWong, TJohns, LMargosiak, SALeppla, SHJohnson, AT Antidotes to anthrax lethal factor intoxication. Part 3: Evaluation of core structures and further modifications to the C2-side chain. Bioorg Med Chem Lett22:2242-6 (2012) 
 
Matrix metalloproteinase-14
Name:Matrix metalloproteinase-14
Type:Protein
Mol. Mass.:65900.19
Organism:Homo sapiens (Human)
Description:P50281
Residue:582
BDBM50379535
NameBDBM50379535
Synonyms:CHEMBL2010824
TypeSmall organic molecule
Emp. Form.C24H32F2N2O2
Mol. Mass.418.5199
SMILESCCC(NCCCC[C@@H](Cc1cc(C)c(F)c(C)c1)C(=O)NO)c1ccc(F)cc1