Reaction Details
TargetMacrophage metalloelastase
LigandBDBM50379534
Substrate/Competitorn/a
Meas. Tech.ChEMBL_811340 (CHEMBL2013520)
Ki>50000±n/a nM
Citation Jiao, GSKim, SMoayeri, MCrown, DThai, ACregar-Hernandez, LMcKasson, LSankaran, BLehrer, AWong, TJohns, LMargosiak, SALeppla, SHJohnson, AT Antidotes to anthrax lethal factor intoxication. Part 3: Evaluation of core structures and further modifications to the C2-side chain. Bioorg Med Chem Lett22:2242-6 (2012) 
 
Macrophage metalloelastase
Name:Macrophage metalloelastase
Type:Enzyme
Mol. Mass.:54012.99
Organism:Homo sapiens (Human)
Description:P39900
Residue:470
BDBM50379534
NameBDBM50379534
Synonyms:CHEMBL2012837
TypeSmall organic molecule
Emp. Form.C23H30F2N2O3
Mol. Mass.420.4927
SMILESCCC(NCCCC[C@@H](Oc1cc(C)c(F)c(C)c1)C(=O)NO)c1ccc(F)cc1