Reaction Details
TargetMatrix metalloproteinase-9
LigandBDBM50379536
Substrate/Competitorn/a
Meas. Tech.ChEMBL_811339 (CHEMBL2013519)
Ki>50000±n/a nM
Citation Jiao, GSKim, SMoayeri, MCrown, DThai, ACregar-Hernandez, LMcKasson, LSankaran, BLehrer, AWong, TJohns, LMargosiak, SALeppla, SHJohnson, AT Antidotes to anthrax lethal factor intoxication. Part 3: Evaluation of core structures and further modifications to the C2-side chain. Bioorg Med Chem Lett22:2242-6 (2012) 
 
Matrix metalloproteinase-9
Name:Matrix metalloproteinase-9
Type:Enzyme
Mol. Mass.:78452.28
Organism:Homo sapiens (Human)
Description:P14780
Residue:707
BDBM50379536
NameBDBM50379536
Synonyms:CHEMBL2012836
TypeSmall organic molecule
Emp. Form.C23H31F2N3O2
Mol. Mass.419.5079
SMILESCCC(NCCCC[C@@H](Nc1cc(C)c(F)c(C)c1)C(=O)NO)c1ccc(F)cc1