Reaction Details
TargetStromelysin-1
LigandBDBM50379535
Substrate/Competitorn/a
Meas. Tech.ChEMBL_811338 (CHEMBL2013518)
Ki>50000±n/a nM
Citation Jiao, GSKim, SMoayeri, MCrown, DThai, ACregar-Hernandez, LMcKasson, LSankaran, BLehrer, AWong, TJohns, LMargosiak, SALeppla, SHJohnson, AT Antidotes to anthrax lethal factor intoxication. Part 3: Evaluation of core structures and further modifications to the C2-side chain. Bioorg Med Chem Lett22:2242-6 (2012) 
 
Stromelysin-1
Name:Stromelysin-1
Type:Enzyme
Mol. Mass.:53973.13
Organism:Homo sapiens (Human)
Description: P08254
Residue:477
BDBM50379535
NameBDBM50379535
Synonyms:CHEMBL2010824
TypeSmall organic molecule
Emp. Form.C24H32F2N2O2
Mol. Mass.418.5199
SMILESCCC(NCCCC[C@@H](Cc1cc(C)c(F)c(C)c1)C(=O)NO)c1ccc(F)cc1