Reaction Details
TargetInterstitial collagenase
LigandBDBM50340754
Substrate/Competitorn/a
Meas. Tech.ChEMBL_811337 (CHEMBL2013517)
Ki>50000±n/a nM
Citation Jiao, GSKim, SMoayeri, MCrown, DThai, ACregar-Hernandez, LMcKasson, LSankaran, BLehrer, AWong, TJohns, LMargosiak, SALeppla, SHJohnson, AT Antidotes to anthrax lethal factor intoxication. Part 3: Evaluation of core structures and further modifications to the C2-side chain. Bioorg Med Chem Lett22:2242-6 (2012) 
 
Interstitial collagenase
Name:Interstitial collagenase
Type:Enzyme
Mol. Mass.:54010.26
Organism:Homo sapiens (Human)
Description: P03956
Residue:469
BDBM50340754
NameBDBM50340754
Synonyms:(S)-2-(4-fluoro-3,5-dimethylbenzyl)-6-(4-fluorobenzylamino)-N-hydroxyhexanamide | CHEMBL1760324
TypeSmall organic molecule
Emp. Form.C22H28F2N2O2
Mol. Mass.390.4667
SMILESCc1cc(C[C@H](CCCCNCc2ccc(F)cc2)C(=O)NO)cc(C)c1F