Reaction Details
TargetLethal factor
LigandBDBM50379541
Substrate/Competitorn/a
Meas. Tech.ChEMBL_811334 (CHEMBL2013514)
Ki 0.23±n/a nM
Citation Jiao, GSKim, SMoayeri, MCrown, DThai, ACregar-Hernandez, LMcKasson, LSankaran, BLehrer, AWong, TJohns, LMargosiak, SALeppla, SHJohnson, AT Antidotes to anthrax lethal factor intoxication. Part 3: Evaluation of core structures and further modifications to the C2-side chain. Bioorg Med Chem Lett22:2242-6 (2012) 
 
Lethal factor
Name:Lethal factor
Type:PROTEIN
Mol. Mass.:93758.56
Organism:Bacillus anthracis
Description:ChEMBL_1460338
Residue:809
BDBM50379541
NameBDBM50379541
Synonyms:CHEMBL2012832
TypeSmall organic molecule
Emp. Form.C26H36F2N2O2
Mol. Mass.446.573
SMILESCC(C)C[C@@H](NCCCC[C@@H](Cc1cc(C)c(F)c(C)c1)C(=O)NO)c1ccc(F)cc1