Reaction Details
TargetPotassium voltage-gated channel subfamily H member 2
LigandBDBM50379535
Substrate/Competitorn/a
Meas. Tech.ChEMBL_811343 (CHEMBL2013523)
IC50 13300±n/a nM
Citation Jiao, GSKim, SMoayeri, MCrown, DThai, ACregar-Hernandez, LMcKasson, LSankaran, BLehrer, AWong, TJohns, LMargosiak, SALeppla, SHJohnson, AT Antidotes to anthrax lethal factor intoxication. Part 3: Evaluation of core structures and further modifications to the C2-side chain. Bioorg Med Chem Lett22:2242-6 (2012) 
 
Potassium voltage-gated channel subfamily H member 2
Name:Potassium voltage-gated channel subfamily H member 2
Type:Multi-pass membrane protein
Mol. Mass.:126672.65
Organism:Homo sapiens (Human)
Description:Q12809
Residue:1159
BDBM50379535
NameBDBM50379535
Synonyms:CHEMBL2010824
TypeSmall organic molecule
Emp. Form.C24H32F2N2O2
Mol. Mass.418.5199
SMILESCCC(NCCCC[C@@H](Cc1cc(C)c(F)c(C)c1)C(=O)NO)c1ccc(F)cc1