Reaction Details
TargetPotassium voltage-gated channel subfamily H member 2
LigandBDBM50340758
Substrate/Competitorn/a
Meas. Tech.ChEMBL_811343 (CHEMBL2013523)
IC50 2000±n/a nM
Citation Jiao, GSKim, SMoayeri, MCrown, DThai, ACregar-Hernandez, LMcKasson, LSankaran, BLehrer, AWong, TJohns, LMargosiak, SALeppla, SHJohnson, AT Antidotes to anthrax lethal factor intoxication. Part 3: Evaluation of core structures and further modifications to the C2-side chain. Bioorg Med Chem Lett22:2242-6 (2012) 
 
Potassium voltage-gated channel subfamily H member 2
Name:Potassium voltage-gated channel subfamily H member 2
Type:Multi-pass membrane protein
Mol. Mass.:126672.65
Organism:Homo sapiens (Human)
Description:Q12809
Residue:1159
BDBM50340758
NameBDBM50340758
Synonyms:(S)-6-(4-fluorobenzylamino)-2-((R)-2-(4-fluorophenyl)-2-methoxyethyl)-N-hydroxyhexanamide | CHEMBL1760318
TypeSmall organic molecule
Emp. Form.C22H28F2N2O3
Mol. Mass.406.4661
SMILESCO[C@H](C[C@H](CCCCNCc1ccc(F)cc1)C(=O)NO)c1ccc(F)cc1