Reaction Details
TargetGlutamate receptor ionotropic, NMDA 2B
LigandBDBM50379686
Substrate/Competitorn/a
Meas. Tech.ChEMBL_812025 (CHEMBL2013395)
IC50 794.33±n/a nM
Citation Davies, DJCrowe, MLucas, NQuinn, JMiller, DDPritchard, SGrose, DBettini, ECalcinaghi, NVirginio, CAbberley, LGoldsmith, PMichel, ADChessell, IPKew, JNMiller, NDGunthorpe, MJ A novel series of benzimidazole NR2B-selective NMDA receptor antagonists. Bioorg Med Chem Lett22:2620-3 (2012) 
 
Glutamate receptor ionotropic, NMDA 2B
Name:Glutamate receptor ionotropic, NMDA 2B
Type:PROTEIN
Mol. Mass.:166375.46
Organism:Homo sapiens (Human)
Description:ChEMBL_1438829
Residue:1484
BDBM50379686
NameBDBM50379686
Synonyms:CHEMBL2010886
TypeSmall organic molecule
Emp. Form.C17H18FN3
Mol. Mass.283.3433
SMILESCC(C)NCc1c(F)ccc2nc([nH]c12)-c1ccccc1