Reaction Details
TargetGlutamate receptor ionotropic, NMDA 2B
LigandBDBM50379689
Substrate/Competitorn/a
Meas. Tech.ChEMBL_812025 (CHEMBL2013395)
IC50 251.19±n/a nM
Citation Davies, DJCrowe, MLucas, NQuinn, JMiller, DDPritchard, SGrose, DBettini, ECalcinaghi, NVirginio, CAbberley, LGoldsmith, PMichel, ADChessell, IPKew, JNMiller, NDGunthorpe, MJ A novel series of benzimidazole NR2B-selective NMDA receptor antagonists. Bioorg Med Chem Lett22:2620-3 (2012) 
 
Glutamate receptor ionotropic, NMDA 2B
Name:Glutamate receptor ionotropic, NMDA 2B
Type:PROTEIN
Mol. Mass.:166375.46
Organism:Homo sapiens (Human)
Description:ChEMBL_1438829
Residue:1484
BDBM50379689
NameBDBM50379689
Synonyms:CHEMBL2013202
TypeSmall organic molecule
Emp. Form.C16H17N3O
Mol. Mass.267.3257
SMILESCN(C)Cc1c(O)ccc2nc([nH]c12)-c1ccccc1