Reaction Details
TargetBeta-secretase 1
LigandBDBM50379871
Substrate/Competitorn/a
Meas. Tech.ChEMBL_809982 (CHEMBL2015091)
IC50 4400±n/a nM
Citation Cumming, JNSmith, EMWang, LMisiaszek, JDurkin, JPan, JIserloh, UWu, YZhu, ZStrickland, CVoigt, JChen, XKennedy, MEKuvelkar, RHyde, LACox, KFavreau, LCzarniecki, MFGreenlee, WJMcKittrick, BAParker, EMStamford, AW Structure based design of iminohydantoin BACE1 inhibitors: identification of an orally available, centrally active BACE1 inhibitor. Bioorg Med Chem Lett22:2444-9 (2012) 
 
Beta-secretase 1
Name:Beta-secretase 1
Type:Protein
Mol. Mass.:55755.10
Organism:Homo sapiens (Human)
Description:P56817
Residue:501
BDBM50379871
NameBDBM50379871
Synonyms:CHEMBL2011995
TypeSmall organic molecule
Emp. Form.C21H17ClN4O
Mol. Mass.376.839
SMILESCN1C(N)=NC(C1=O)(c1cccnc1)c1cccc(c1)-c1cccc(Cl)c1