Reaction Details
TargetBeta-secretase 1
LigandBDBM50379912
Substrate/Competitorn/a
Meas. Tech.ChEMBL_809981 (CHEMBL2015090)
Ki 30±n/a nM
Citation Cumming, JNSmith, EMWang, LMisiaszek, JDurkin, JPan, JIserloh, UWu, YZhu, ZStrickland, CVoigt, JChen, XKennedy, MEKuvelkar, RHyde, LACox, KFavreau, LCzarniecki, MFGreenlee, WJMcKittrick, BAParker, EMStamford, AW Structure based design of iminohydantoin BACE1 inhibitors: identification of an orally available, centrally active BACE1 inhibitor. Bioorg Med Chem Lett22:2444-9 (2012) 
 
Beta-secretase 1
Name:Beta-secretase 1
Type:Protein
Mol. Mass.:55755.10
Organism:Homo sapiens (Human)
Description:P56817
Residue:501
BDBM50379912
NameBDBM50379912
Synonyms:CHEMBL2012000
TypeSmall organic molecule
Emp. Form.C19H17Cl2N3O
Mol. Mass.374.264
SMILESCN1C(N)=NC(C2CC2)(C1=O)c1cccc(c1)-c1cc(Cl)cc(Cl)c1