Reaction Details
TargetcAMP-specific 3',5'-cyclic phosphodiesterase 4D
LigandBDBM50379972
Substrate/Competitorn/a
Meas. Tech.ChEMBL_810014 (CHEMBL2015123)
IC50 0.7±n/a nM
Citation Kuang, RShue, HJXiao, LBlythin, DJShih, NYChen, XGu, DSchwerdt, JLin, LTing, PCCao, JAslanian, RPiwinski, JJPrelusky, DWu, PZhang, JZhang, XCelly, CSBillah, MWang, P Discovery of oxazole-based PDE4 inhibitors with picomolar potency. Bioorg Med Chem Lett22:2594-7 (2012) 
 
cAMP-specific 3',5'-cyclic phosphodiesterase 4D
Name:cAMP-specific 3',5'-cyclic phosphodiesterase 4D
Type:Protein
Mol. Mass.:91092.69
Organism:Homo sapiens (Human)
Description:Q08499
Residue:809
BDBM50379972
NameBDBM50379972
Synonyms:CHEMBL2012219
TypeSmall organic molecule
Emp. Form.C23H17F5N4O3
Mol. Mass.492.3981
SMILESCOc1ccc(-c2nc(C(=O)NCc3ccc(F)cc3F)c(CN)o2)c2ccc(nc12)C(F)(F)F