Reaction Details
TargetAtypical chemokine receptor 3
LigandBDBM50380115
Substrate/Competitorn/a
Meas. Tech.ChEMBL_811526 (CHEMBL2013880)
Ki 1584.89±n/a nM
Citation Wijtmans, MMaussang, DSirci, FScholten, DJCanals, MMujic-Delic, AChong, MChatalic, KLCusters, HJanssen, Ede Graaf, CSmit, MJde Esch, IJLeurs, R Synthesis, modeling and functional activity of substituted styrene-amides as small-molecule CXCR7 agonists. Eur J Med Chem51:184-92 (2012) 
 
Atypical chemokine receptor 3
Name:Atypical chemokine receptor 3
Type:Enzyme
Mol. Mass.:41498.84
Organism:Homo sapiens (Human)
Description:P25106
Residue:362
BDBM50380115
NameBDBM50380115
Synonyms:CHEMBL2013233
TypeSmall organic molecule
Emp. Form.C26H30F2N2O3
Mol. Mass.456.5248
SMILESCN1CCCC1CCN(C\C(C)=C\c1ccc(F)cc1F)C(=O)c1ccc2OCCOc2c1