Reaction Details
TargetAtypical chemokine receptor 3
LigandBDBM50380116
Substrate/Competitorn/a
Meas. Tech.ChEMBL_811526 (CHEMBL2013880)
Ki 398.11±n/a nM
Citation Wijtmans, MMaussang, DSirci, FScholten, DJCanals, MMujic-Delic, AChong, MChatalic, KLCusters, HJanssen, Ede Graaf, CSmit, MJde Esch, IJLeurs, R Synthesis, modeling and functional activity of substituted styrene-amides as small-molecule CXCR7 agonists. Eur J Med Chem51:184-92 (2012) 
 
Atypical chemokine receptor 3
Name:Atypical chemokine receptor 3
Type:Enzyme
Mol. Mass.:41498.84
Organism:Homo sapiens (Human)
Description:P25106
Residue:362
BDBM50380116
NameBDBM50380116
Synonyms:CHEMBL2013212
TypeSmall organic molecule
Emp. Form.C27H36N2O5
Mol. Mass.468.5851
SMILESCOc1cc(cc(OC)c1OC)C(=O)N(CCCN1CCOCC1)C\C(C)=C\c1ccccc1