Reaction Details
TargetAtypical chemokine receptor 3
LigandBDBM50380122
Substrate/Competitorn/a
Meas. Tech.ChEMBL_811526 (CHEMBL2013880)
Ki 794.33±n/a nM
Citation Wijtmans, MMaussang, DSirci, FScholten, DJCanals, MMujic-Delic, AChong, MChatalic, KLCusters, HJanssen, Ede Graaf, CSmit, MJde Esch, IJLeurs, R Synthesis, modeling and functional activity of substituted styrene-amides as small-molecule CXCR7 agonists. Eur J Med Chem51:184-92 (2012) 
 
Atypical chemokine receptor 3
Name:Atypical chemokine receptor 3
Type:Enzyme
Mol. Mass.:41498.84
Organism:Homo sapiens (Human)
Description:P25106
Residue:362
BDBM50380122
NameBDBM50380122
Synonyms:CHEMBL2013220
TypeSmall organic molecule
Emp. Form.C26H34N2O2
Mol. Mass.406.5604
SMILESCOc1ccc(cc1C)C(=O)N(CCC1CCCN1C)C\C(C)=C\c1ccccc1