Reaction Details
TargetAtypical chemokine receptor 3
LigandBDBM50380123
Substrate/Competitorn/a
Meas. Tech.ChEMBL_811526 (CHEMBL2013880)
Ki 31.62±n/a nM
Citation Wijtmans, MMaussang, DSirci, FScholten, DJCanals, MMujic-Delic, AChong, MChatalic, KLCusters, HJanssen, Ede Graaf, CSmit, MJde Esch, IJLeurs, R Synthesis, modeling and functional activity of substituted styrene-amides as small-molecule CXCR7 agonists. Eur J Med Chem51:184-92 (2012) 
 
Atypical chemokine receptor 3
Name:Atypical chemokine receptor 3
Type:Enzyme
Mol. Mass.:41498.84
Organism:Homo sapiens (Human)
Description:P25106
Residue:362
BDBM50380123
NameBDBM50380123
Synonyms:CHEMBL2013222
TypeSmall organic molecule
Emp. Form.C27H34F2N2O4
Mol. Mass.488.5667
SMILESCOc1cc(cc(OC)c1OC)C(=O)N(CCC1CCCN1C)C\C(C)=C\c1ccc(F)cc1F