Reaction Details
TargetAtypical chemokine receptor 3
LigandBDBM50380132
Substrate/Competitorn/a
Meas. Tech.ChEMBL_811526 (CHEMBL2013880)
Ki 1258.93±n/a nM
Citation Wijtmans, MMaussang, DSirci, FScholten, DJCanals, MMujic-Delic, AChong, MChatalic, KLCusters, HJanssen, Ede Graaf, CSmit, MJde Esch, IJLeurs, R Synthesis, modeling and functional activity of substituted styrene-amides as small-molecule CXCR7 agonists. Eur J Med Chem51:184-92 (2012) 
 
Atypical chemokine receptor 3
Name:Atypical chemokine receptor 3
Type:Enzyme
Mol. Mass.:41498.84
Organism:Homo sapiens (Human)
Description:P25106
Residue:362
BDBM50380132
NameBDBM50380132
Synonyms:CHEMBL2010828
TypeSmall organic molecule
Emp. Form.C27H35FN2O4
Mol. Mass.470.5762
SMILESCOc1ccc(\C=C(/C)CN(CCC2CCCN2C)C(=O)c2ccc(OC)c(OC)c2)c(F)c1