Reaction Details
TargetAcetylcholinesterase
LigandBDBM50380201
Substrate/Competitorn/a
Meas. Tech.ChEMBL_811772 (CHEMBL2014393)
Ki 16900±n/a nM
Citation Cho, JKRyu, YBCurtis-Long, MJRyu, HWYuk, HJKim, DWKim, HJLee, WSPark, KH Cholinestrase inhibitory effects of geranylated flavonoids from Paulownia tomentosa fruits. Bioorg Med Chem20:2595-602 (2012) 
 
Acetylcholinesterase
Name:Acetylcholinesterase
Type:Enzyme
Mol. Mass.:67792.70
Organism:Homo sapiens (Human)
Description:P22303
Residue:614
BDBM50380201
NameBDBM50380201
Synonyms:CHEMBL2011403
TypeSmall organic molecule
Emp. Form.C26H30O8
Mol. Mass.470.5116
SMILES[#6]-[#8]-c1c(-[#8])cc(cc1-[#8])-[#6]-1-[#8]-c2cc(-[#8])c(-[#6]\[#6]=[#6](/[#6])-[#6]-[#6]\[#6]=[#6](\[#6])-[#6])c(-[#8])c2-[#6](=O)-[#6@@H]-1-[#8]