Reaction Details
TargetCarboxylic ester hydrolase
LigandBDBM50380205
Substrate/Competitorn/a
Meas. Tech.ChEMBL_811911 (CHEMBL2013281)
Ki 1200±n/a nM
Citation Cho, JKRyu, YBCurtis-Long, MJRyu, HWYuk, HJKim, DWKim, HJLee, WSPark, KH Cholinestrase inhibitory effects of geranylated flavonoids from Paulownia tomentosa fruits. Bioorg Med Chem20:2595-602 (2012) 
 
Carboxylic ester hydrolase
Name:Carboxylic ester hydrolase
Type:Protein
Mol. Mass.:68842.83
Organism:Equus caballus (Horse)
Description:Q9N1N9
Residue:602
BDBM50380205
NameBDBM50380205
Synonyms:NYMPHAEOL A
TypeSmall organic molecule
Emp. Form.C25H28O6
Mol. Mass.424.4862
SMILES[#6]\[#6](-[#6])=[#6]\[#6]-[#6]\[#6](-[#6])=[#6]\[#6]-c1c(-[#8])cc2-[#8]-[#6@@H](-[#6]-[#6](=O)-c2c1-[#8])-c1ccc(-[#8])c(-[#8])c1