Reaction Details
TargetPhosphatidylinositol 4,5-bisphosphate 3-kinase catalytic subunit alpha isoform
LigandBDBM50380314
Substrate/Competitorn/a
Meas. Tech.ChEMBL_813833 (CHEMBL2020202)
IC50 73±n/a nM
Citation Liu, KKZhu, JSmith, GLYin, MJBailey, SChen, JHHu, QHuang, QLi, CLi, QJMarx, MAPaderes, GRichardson, PFSach, NWWalls, MWells, PABaxi, SZou, A Highly Selective and Potent Thiophenes as PI3K Inhibitors with Oral Antitumor Activity. ACS Med Chem Lett2:809-813 (2011) 
 
Phosphatidylinositol 4,5-bisphosphate 3-kinase catalytic subunit alpha isoform
Name:Phosphatidylinositol 4,5-bisphosphate 3-kinase catalytic subunit alpha isoform
Type:Enzyme Subunit
Mol. Mass.:124294.87
Organism:Homo sapiens (Human)
Description:P42336
Residue:1068
BDBM50380314
NameBDBM50380314
Synonyms:CHEMBL2017648
TypeSmall organic molecule
Emp. Form.C17H14ClN5OS
Mol. Mass.371.844
SMILESClc1ccc(cc1)-c1c(sc(N2CCOCC2)c1C#N)-c1nnc[nH]1