Reaction Details
TargetPhosphatidylinositol 4,5-bisphosphate 3-kinase catalytic subunit alpha isoform
LigandBDBM50380371
Substrate/Competitorn/a
Meas. Tech.ChEMBL_812833 (CHEMBL2020154)
IC50 2.2±n/a nM
Citation Burger, MTPecchi, SWagman, ANi, ZJKnapp, MHendrickson, TAtallah, GPfister, KZhang, YBartulis, SFrazier, KNg, SSmith, AVerhagen, JHaznedar, JHuh, KIwanowicz, EXin, XMenezes, DMerritt, HLee, IWiesmann, MKaufman, SCrawford, KChin, MBussiere, DShoemaker, KZaror, IMaira, SMVoliva, CF Identification of NVP-BKM120 as a Potent, Selective, Orally Bioavailable Class I PI3 Kinase Inhibitor for Treating Cancer. ACS Med Chem Lett2:774-779 (2011) 
 
Phosphatidylinositol 4,5-bisphosphate 3-kinase catalytic subunit alpha isoform
Name:Phosphatidylinositol 4,5-bisphosphate 3-kinase catalytic subunit alpha isoform
Type:Enzyme Subunit
Mol. Mass.:124294.87
Organism:Homo sapiens (Human)
Description:P42336
Residue:1068
BDBM50380371
NameBDBM50380371
Synonyms:CHEMBL2017970
TypeSmall organic molecule
Emp. Form.C22H19F3N8O
Mol. Mass.468.4345
SMILESNc1ncc(-c2cc(Nc3cnc4ccccc4c3)nc(n2)N2CCOCC2)c(n1)C(F)(F)F