Reaction Details
TargetRibosomal protein S6 kinase beta-1
LigandBDBM50380930
Substrate/Competitorn/a
Meas. Tech.ChEMBL_814030 (CHEMBL2020582)
IC50 1±n/a nM
Citation Rice, KDKim, MHBussenius, JAnand, NKBlazey, CMBowles, OJCanne-Bannen, LChan, DSChen, BCo, EWCostanzo, SDeFina, SCDubenko, LEngst, SFranzini, MHuang, PJammalamadaka, VKhoury, RGKlein, RRLaird, ADLe, DTMac, MBMatthews, DJMarkby, DMiller, NNuss, JMParks, JJTsang, THTsuhako, ALWang, YXu, W Pyrazolopyrimidines as dual Akt/p70S6K inhibitors. Bioorg Med Chem Lett22:2693-7 (2012) 
 
Ribosomal protein S6 kinase beta-1
Name:Ribosomal protein S6 kinase beta-1
Type:Enzyme
Mol. Mass.:59139.89
Organism:Homo sapiens (Human)
Description:His-tagged S6K1.
Residue:525
BDBM50380930
NameBDBM50380930
Synonyms:CHEMBL2016890
TypeSmall organic molecule
Emp. Form.C25H31BrN10O
Mol. Mass.567.484
SMILESCc1noc(n1)-c1cc(NCCN2CCCC2)c(C)c(c1)N1CCN(CC1)c1ncnc2n[nH]c(Br)c12