Reaction Details
TargetRibosomal protein S6 kinase beta-1
LigandBDBM50380939
Substrate/Competitorn/a
Meas. Tech.ChEMBL_814030 (CHEMBL2020582)
IC50 2±n/a nM
Citation Rice, KDKim, MHBussenius, JAnand, NKBlazey, CMBowles, OJCanne-Bannen, LChan, DSChen, BCo, EWCostanzo, SDeFina, SCDubenko, LEngst, SFranzini, MHuang, PJammalamadaka, VKhoury, RGKlein, RRLaird, ADLe, DTMac, MBMatthews, DJMarkby, DMiller, NNuss, JMParks, JJTsang, THTsuhako, ALWang, YXu, W Pyrazolopyrimidines as dual Akt/p70S6K inhibitors. Bioorg Med Chem Lett22:2693-7 (2012) 
 
Ribosomal protein S6 kinase beta-1
Name:Ribosomal protein S6 kinase beta-1
Type:Enzyme
Mol. Mass.:59139.89
Organism:Homo sapiens (Human)
Description:His-tagged S6K1.
Residue:525
BDBM50380939
NameBDBM50380939
Synonyms:CHEMBL2016893
TypeSmall organic molecule
Emp. Form.C26H32BrF3N8O
Mol. Mass.609.484
SMILESCc1c(NCCN2CCCC2)cc(cc1N1CCN(CC1)c1ncnc2n[nH]c(Br)c12)C(=O)CCC(F)(F)F