Reaction Details
TargetPhosphatidylinositol 4,5-bisphosphate 3-kinase catalytic subunit beta isoform
LigandBDBM50365868
Substrate/Competitorn/a
Meas. Tech.ChEMBL_814276 (CHEMBL2019373)
IC50 1.3±n/a nM
Citation Sanchez, RMErhard, KHardwicke, MALin, HMcSurdy-Freed, JPlant, RRaha, KRominger, CMSchaber, MDSpengler, MDMoore, MLYu, HLuengo, JITedesco, RRivero, RA Synthesis and structure-activity relationships of 1,2,4-triazolo[1,5-a]pyrimidin-7(3H)-ones as novel series of potentß isoform selective phosphatidylinositol 3-kinase inhibitors. Bioorg Med Chem Lett22:3198-202 (2012) 
 
Phosphatidylinositol 4,5-bisphosphate 3-kinase catalytic subunit beta isoform
Name:Phosphatidylinositol 4,5-bisphosphate 3-kinase catalytic subunit beta isoform
Type:Enzyme Subunit
Mol. Mass.:122769.00
Organism:Homo sapiens (Human)
Description:P42338
Residue:1070
BDBM50365868
NameBDBM50365868
Synonyms:CHEMBL1957857
TypeSmall organic molecule
Emp. Form.C20H21F3N4O2
Mol. Mass.406.4015
SMILESCc1cn2c(nc(cc2=O)N2CCOCC2)n1Cc1cccc(c1C)C(F)(F)F